Estoy tratando de instalar el repositorio apache-storm que cloné. Y obtengo el siguiente error al llegar a storm-client. ¿Cómo resolver esto?

[ERROR] Error al ejecutar el objetivo org.apache.maven.plugins: maven-surefire-plugin: 2.22.1: prueba (prueba predeterminada) en el proyecto tormenta-cliente: hay fallas de prueba. [ERROR] [ERROR] Consulte D: \ FYP_1 \ storm \ storm-client \ target \ surefire-reports para ver los resultados de las pruebas individuales.

El siguiente archivo AutoSSLTest en surefire-reports tuvo este error:


Conjunto de prueba: AutoSSLTest

Tests run: 3, Failures: 0, Errors: 1, Skipped: 0, Time elapsed: 0.007 s <<< FAILURE! - in AutoSSLTest testpopulateCredentials Time elapsed: 0 s <<< ERROR! java.io.IOException: failed to create base directory at org.apache.storm.security.auth.AutoSSLTest.testpopulateCredentials(AutoSSLTest.java:84) at sun.reflect.NativeMethodAccessorImpl.invoke0(Native Method) at sun.reflect.NativeMethodAccessorImpl.invoke(NativeMethodAccessorImpl.java:62) at sun.reflect.DelegatingMethodAccessorImpl.invoke(DelegatingMethodAccessorImpl.java:43) at java.lang.reflect.Method.invoke(Method.java:498) at org.junit.runners.model.FrameworkMethod$1.runReflectiveCall(FrameworkMethod.java:50) at org.junit.internal.runners.model.ReflectiveCallable.run(ReflectiveCallable.java:12) at org.junit.runners.model.FrameworkMethod.invokeExplosively(FrameworkMethod.java:47) at org.junit.internal.runners.statements.InvokeMethod.evaluate(InvokeMethod.java:17) at org.junit.runners.ParentRunner.runLeaf(ParentRunner.java:325) at org.junit.runners.BlockJUnit4ClassRunner.runChild(BlockJUnit4ClassRunner.java:78) at org.junit.runners.BlockJUnit4ClassRunner.runChild(BlockJUnit4ClassRunner.java:57) at org.junit.runners.ParentRunner$3.run(ParentRunner.java:290) at org.junit.runners.ParentRunner$1.schedule(ParentRunner.java:71) at org.junit.runners.ParentRunner.runChildren(ParentRunner.java:288) at org.junit.runners.ParentRunner.access$000(ParentRunner.java:58) at org.junit.runners.ParentRunner$2.evaluate(ParentRunner.java:268) at org.junit.runners.ParentRunner.run(ParentRunner.java:363) at org.junit.runner.JUnitCore.run(JUnitCore.java:137) at org.junit.runner.JUnitCore.run(JUnitCore.java:115) at org.junit.vintage.engine.execution.RunnerExecutor.execute(RunnerExecutor.java:39) at java.util.stream.ForEachOps$ForEachOp$OfRef.accept(ForEachOps.java:184) at java.util.stream.ReferencePipeline$3$1.accept(ReferencePipeline.java:193) at java.util.Iterator.forEachRemaining(Iterator.java:116) at java.util.Spliterators$IteratorSpliterator.forEachRemaining(Spliterators.java:1801) at java.util.stream.AbstractPipeline.copyInto(AbstractPipeline.java:481) at java.util.stream.AbstractPipeline.wrapAndCopyInto(AbstractPipeline.java:471) at java.util.stream.ForEachOps$ForEachOp.evaluateSequential(ForEachOps.java:151) at java.util.stream.ForEachOps$ForEachOp$OfRef.evaluateSequential(ForEachOps.java:174) at java.util.stream.AbstractPipeline.evaluate(AbstractPipeline.java:234) at java.util.stream.ReferencePipeline.forEach(ReferencePipeline.java:418) at org.junit.vintage.engine.VintageTestEngine.executeAllChildren(VintageTestEngine.java:79) at org.junit.vintage.engine.VintageTestEngine.execute(VintageTestEngine.java:70) at org.junit.platform.launcher.core.DefaultLauncher.execute(DefaultLauncher.java:220) at org.junit.platform.launcher.core.DefaultLauncher.lambda$execute$6(DefaultLauncher.java:188) at org.junit.platform.launcher.core.DefaultLauncher.withInterceptedStreams(DefaultLauncher.java:202) at org.junit.platform.launcher.core.DefaultLauncher.execute(DefaultLauncher.java:181) at org.junit.platform.launcher.core.DefaultLauncher.execute(DefaultLauncher.java:128) at org.apache.maven.surefire.junitplatform.JUnitPlatformProvider.invokeAllTests(JUnitPlatformProvider.java:142) at org.apache.maven.surefire.junitplatform.JUnitPlatformProvider.invoke(JUnitPlatformProvider.java:109) at org.apache.maven.surefire.booter.ForkedBooter.invokeProviderInSameClassLoader(ForkedBooter.java:384) at org.apache.maven.surefire.booter.ForkedBooter.runSuitesInProcess(ForkedBooter.java:345) at org.apache.maven.surefire.booter.ForkedBooter.execute(ForkedBooter.java:126) at org.apache.maven.surefire.booter.ForkedBooter.main(ForkedBooter.java:418)

Respuesta 1

Tenía la aplicación básica Spring MVC + Hibernate. Aquí está mi web.xml: <? Xml version = "1.0" encoding = "UTF-8"?> <Web-app xmlns = "http://java.sun.com/xml/ns/javaee" xmlns: xsi = "http: // ...

Primero un poco de contexto: Parte 1: obtengo todos los valores de la columna VOTOS en la tabla RESULTADOS DE LA ENCUESTA Parte 2: Cada vez que vote por un animal específico, addVote () se activará con su parámetro específico I ...

Este es un ejemplo simplificado: tengo dos hilos: ¿Puede JavaME y / Proguard reordenar las declaraciones obX = ..., de modo que thread_B tenga una excepción de puntero nulo en ob1.someMethod? thread_A: ...

Estoy trabajando en una aplicación grande que tiene diferentes condiciones (ifs) y diferentes métodos asociados con ella. Sugiera una forma de optimizar el código mencionado a continuación (reduzca la cantidad de ifs anidados como ...