Idea Intellij - Gradle: Ejecución fallida para la tarea ': compileJava'

Estoy tratando de importar el proyecto Gradle en Intellij Idea y obtengo un error. Se toman los siguientes pasos:

  1. "Importar proyecto" -> abrir el archivo build.gradle
  2. "Usar el envoltorio de gradle predeterminado (recomendado)" está marcado.
  3. Presione "Aceptar" y obtenga la ventana de diálogo con el mensaje "La compilación falló con el código de salida 2; vea la salida del error del compilador para más detalles. Consulte el registro IDE para más detalles (Ayuda | Mostrar registro)"
  4. Abro el archivo de registro y veo el siguiente seguimiento de pila:

2017-05-11 10:21:53,097 [  30507]   INFO -
.project.GradleProjectResolver - Gradle project resolve error 
org.gradle.tooling.BuildException: Could not run build action using
Gradle distribution
'file:/C:/projects/erib/gradle/wrapper/gradle-2.14-bin.zip'.    at
org.gradle.tooling.internal.consumer.ResultHandlerAdapter.onFailure(ResultHandlerAdapter.java:53)
    at
org.gradle.tooling.internal.consumer.async.DefaultAsyncConsumerActionExecutor$1$1.run(DefaultAsyncConsumerActionExecutor.java:57)
    at
org.gradle.internal.concurrent.DefaultExecutorFactory$StoppableExecutorImpl$1.run(DefaultExecutorFactory.java:64)
    at
java.util.concurrent.ThreadPoolExecutor.runWorker(ThreadPoolExecutor.java:1142)
    at
java.util.concurrent.ThreadPoolExecutor$Worker.run(ThreadPoolExecutor.java:617)
    at java.lang.Thread.run(Thread.java:745)    at
org.gradle.tooling.internal.consumer.BlockingResultHandler.getResult(BlockingResultHandler.java:46)
    at
org.gradle.tooling.internal.consumer.DefaultBuildActionExecuter.run(DefaultBuildActionExecuter.java:46)
    at
org.jetbrains.plugins.gradle.service.project.GradleProjectResolver.doResolveProjectInfo(GradleProjectResolver.java:174)
    at
org.jetbrains.plugins.gradle.service.project.GradleProjectResolver.access$300(GradleProjectResolver.java:63)
    at
org.jetbrains.plugins.gradle.service.project.GradleProjectResolver$ProjectConnectionDataNodeFunction.fun(GradleProjectResolver.java:359)
    at
org.jetbrains.plugins.gradle.service.project.GradleProjectResolver$ProjectConnectionDataNodeFunction.fun(GradleProjectResolver.java:331)
    at
org.jetbrains.plugins.gradle.service.project.GradleExecutionHelper.execute(GradleExecutionHelper.java:214)
    at
org.jetbrains.plugins.gradle.service.project.GradleProjectResolver.resolveProjectInfo(GradleProjectResolver.java:95)
    at
org.jetbrains.plugins.gradle.service.project.GradleProjectResolver.resolveProjectInfo(GradleProjectResolver.java:63)
    at
com.intellij.openapi.externalSystem.service.remote.RemoteExternalSystemProjectResolverImpl$1.produce(RemoteExternalSystemProjectResolverImpl.java:41)
    at
com.intellij.openapi.externalSystem.service.remote.RemoteExternalSystemProjectResolverImpl$1.produce(RemoteExternalSystemProjectResolverImpl.java:37)
    at
com.intellij.openapi.externalSystem.service.remote.AbstractRemoteExternalSystemService.execute(AbstractRemoteExternalSystemService.java:59)
    at
com.intellij.openapi.externalSystem.service.remote.RemoteExternalSystemProjectResolverImpl.resolveProjectInfo(RemoteExternalSystemProjectResolverImpl.java:37)
    at
com.intellij.openapi.externalSystem.service.remote.wrapper.ExternalSystemProjectResolverWrapper.resolveProjectInfo(ExternalSystemProjectResolverWrapper.java:49)
    at
com.intellij.openapi.externalSystem.service.internal.ExternalSystemResolveProjectTask.doExecute(ExternalSystemResolveProjectTask.java:51)
    at
com.intellij.openapi.externalSystem.service.internal.AbstractExternalSystemTask.execute(AbstractExternalSystemTask.java:137)
    at
com.intellij.openapi.externalSystem.service.internal.AbstractExternalSystemTask.execute(AbstractExternalSystemTask.java:123)
    at
com.intellij.openapi.externalSystem.util.ExternalSystemUtil$2.execute(ExternalSystemUtil.java:477)
    at
com.intellij.openapi.externalSystem.util.ExternalSystemUtil$3$1.run(ExternalSystemUtil.java:545)
    at
com.intellij.openapi.progress.impl.ProgressManagerImpl$TaskRunnable.run(ProgressManagerImpl.java:621)
    at
com.intellij.openapi.progress.impl.ProgressManagerImpl$7.run(ProgressManagerImpl.java:422)
    at
com.intellij.openapi.progress.impl.ProgressManagerImpl$3.run(ProgressManagerImpl.java:194)
    at
com.intellij.openapi.progress.impl.ProgressManagerImpl.a(ProgressManagerImpl.java:281)
    at
com.intellij.openapi.progress.impl.ProgressManagerImpl.executeProcessUnderProgress(ProgressManagerImpl.java:233)
    at
com.intellij.openapi.progress.impl.ProgressManagerImpl.runProcess(ProgressManagerImpl.java:181)
    at
com.intellij.openapi.application.impl.ApplicationImpl$10$1.run(ApplicationImpl.java:641)
    at
com.intellij.openapi.application.impl.ApplicationImpl$8.run(ApplicationImpl.java:406)
    at
java.util.concurrent.Executors$RunnableAdapter.call(Executors.java:511)
    at java.util.concurrent.FutureTask.run(FutureTask.java:266)     at
java.util.concurrent.ThreadPoolExecutor.runWorker(ThreadPoolExecutor.java:1142)
    at
java.util.concurrent.ThreadPoolExecutor$Worker.run(ThreadPoolExecutor.java:617)
    at java.lang.Thread.run(Thread.java:745)    at
org.jetbrains.ide.PooledThreadExecutor$1$1.run(PooledThreadExecutor.java:56)
Caused by: org.gradle.internal.exceptions.LocationAwareException:
Execution failed for task ':compileJava'.   at
org.gradle.initialization.DefaultExceptionAnalyser.transform(DefaultExceptionAnalyser.java:74)
    at
org.gradle.initialization.MultipleBuildFailuresExceptionAnalyser.transform(MultipleBuildFailuresExceptionAnalyser.java:47)
    at
org.gradle.initialization.StackTraceSanitizingExceptionAnalyser.transform(StackTraceSanitizingExceptionAnalyser.java:30)
    at
org.gradle.initialization.DefaultGradleLauncher$1.create(DefaultGradleLauncher.java:100)
    at
org.gradle.initialization.DefaultGradleLauncher$1.create(DefaultGradleLauncher.java:92)
    at
org.gradle.internal.progress.DefaultBuildOperationExecutor.run(DefaultBuildOperationExecutor.java:91)
    at
org.gradle.internal.progress.DefaultBuildOperationExecutor.run(DefaultBuildOperationExecutor.java:63)
    at
org.gradle.initialization.DefaultGradleLauncher.doBuild(DefaultGradleLauncher.java:92)
    at
org.gradle.initialization.DefaultGradleLauncher.run(DefaultGradleLauncher.java:83)
    at
org.gradle.initialization.buildsrc.BuildSrcUpdateFactory.create(BuildSrcUpdateFactory.java:49)
    at
org.gradle.initialization.buildsrc.BuildSrcUpdateFactory.create(BuildSrcUpdateFactory.java:31)
    at
org.gradle.cache.internal.DefaultCacheAccess.useCache(DefaultCacheAccess.java:192)
    at
org.gradle.cache.internal.DefaultPersistentDirectoryStore.useCache(DefaultPersistentDirectoryStore.java:102)
    at
org.gradle.cache.internal.DefaultCacheFactory$ReferenceTrackingCache.useCache(DefaultCacheFactory.java:183)
    at
org.gradle.initialization.buildsrc.BuildSourceBuilder.buildBuildSrc(BuildSourceBuilder.java:86)
    at
org.gradle.initialization.buildsrc.BuildSourceBuilder.access$000(BuildSourceBuilder.java:40)
    at
org.gradle.initialization.buildsrc.BuildSourceBuilder$1.create(BuildSourceBuilder.java:74)
    at
org.gradle.initialization.buildsrc.BuildSourceBuilder$1.create(BuildSourceBuilder.java:71)
    at
org.gradle.internal.progress.DefaultBuildOperationExecutor.run(DefaultBuildOperationExecutor.java:91)
    at
org.gradle.initialization.buildsrc.BuildSourceBuilder.createBuildSourceClasspath(BuildSourceBuilder.java:71)
    at
org.gradle.initialization.buildsrc.BuildSourceBuilder.buildAndCreateClassLoader(BuildSourceBuilder.java:56)
    at
org.gradle.initialization.SettingsHandler.findSettingsAndLoadIfAppropriate(SettingsHandler.java:88)
    at
org.gradle.initialization.SettingsHandler.findAndLoadSettings(SettingsHandler.java:47)
    at
org.gradle.initialization.NotifyingSettingsLoader.findAndLoadSettings(NotifyingSettingsLoader.java:33)
    at
org.gradle.initialization.DefaultGradleLauncher.doBuildStages(DefaultGradleLauncher.java:118)
    at
org.gradle.initialization.DefaultGradleLauncher.access$200(DefaultGradleLauncher.java:32)
    at
org.gradle.initialization.DefaultGradleLauncher$1.create(DefaultGradleLauncher.java:98)
    at
org.gradle.initialization.DefaultGradleLauncher$1.create(DefaultGradleLauncher.java:92)
    at
org.gradle.internal.progress.DefaultBuildOperationExecutor.run(DefaultBuildOperationExecutor.java:91)
    at
org.gradle.internal.progress.DefaultBuildOperationExecutor.run(DefaultBuildOperationExecutor.java:63)
    at
org.gradle.initialization.DefaultGradleLauncher.doBuild(DefaultGradleLauncher.java:92)
    at
org.gradle.initialization.DefaultGradleLauncher.getBuildAnalysis(DefaultGradleLauncher.java:88)
    at
org.gradle.launcher.exec.InProcessBuildActionExecuter$DefaultBuildController.configure(InProcessBuildActionExecuter.java:107)
    at
org.gradle.tooling.internal.provider.runner.ClientProvidedBuildActionRunner.run(ClientProvidedBuildActionRunner.java:45)
    at
org.gradle.launcher.exec.ChainingBuildActionRunner.run(ChainingBuildActionRunner.java:35)
    at
org.gradle.tooling.internal.provider.runner.SubscribableBuildActionRunner.run(SubscribableBuildActionRunner.java:58)
    at
org.gradle.launcher.exec.ChainingBuildActionRunner.run(ChainingBuildActionRunner.java:35)
    at
org.gradle.launcher.exec.InProcessBuildActionExecuter.execute(InProcessBuildActionExecuter.java:48)
    at
org.gradle.launcher.exec.InProcessBuildActionExecuter.execute(InProcessBuildActionExecuter.java:30)
    at
org.gradle.launcher.exec.ContinuousBuildActionExecuter.execute(ContinuousBuildActionExecuter.java:81)
    at
org.gradle.launcher.exec.ContinuousBuildActionExecuter.execute(ContinuousBuildActionExecuter.java:46)
    at
org.gradle.launcher.daemon.server.exec.ExecuteBuild.doBuild(ExecuteBuild.java:52)
    at
org.gradle.launcher.daemon.server.exec.BuildCommandOnly.execute(BuildCommandOnly.java:36)
    at
org.gradle.launcher.daemon.server.api.DaemonCommandExecution.proceed(DaemonCommandExecution.java:120)
    at
org.gradle.launcher.daemon.server.exec.WatchForDisconnection.execute(WatchForDisconnection.java:37)
    at
org.gradle.launcher.daemon.server.api.DaemonCommandExecution.proceed(DaemonCommandExecution.java:120)
    at
org.gradle.launcher.daemon.server.exec.ResetDeprecationLogger.execute(ResetDeprecationLogger.java:26)
    at
org.gradle.launcher.daemon.server.api.DaemonCommandExecution.proceed(DaemonCommandExecution.java:120)
    at
org.gradle.launcher.daemon.server.exec.RequestStopIfSingleUsedDaemon.execute(RequestStopIfSingleUsedDaemon.java:34)
    at
org.gradle.launcher.daemon.server.api.DaemonCommandExecution.proceed(DaemonCommandExecution.java:120)
    at
org.gradle.launcher.daemon.server.exec.ForwardClientInput$2.call(ForwardClientInput.java:74)
    at
org.gradle.launcher.daemon.server.exec.ForwardClientInput$2.call(ForwardClientInput.java:72)
    at org.gradle.util.Swapper.swap(Swapper.java:38)    at
org.gradle.launcher.daemon.server.exec.ForwardClientInput.execute(ForwardClientInput.java:72)
    at
org.gradle.launcher.daemon.server.api.DaemonCommandExecution.proceed(DaemonCommandExecution.java:120)
    at
org.gradle.launcher.daemon.server.health.DaemonHealthTracker.execute(DaemonHealthTracker.java:47)
    at
org.gradle.launcher.daemon.server.api.DaemonCommandExecution.proceed(DaemonCommandExecution.java:120)
    at
org.gradle.launcher.daemon.server.exec.LogToClient.doBuild(LogToClient.java:60)
    at
org.gradle.launcher.daemon.server.exec.BuildCommandOnly.execute(BuildCommandOnly.java:36)
    at
org.gradle.launcher.daemon.server.api.DaemonCommandExecution.proceed(DaemonCommandExecution.java:120)
    at
org.gradle.launcher.daemon.server.exec.EstablishBuildEnvironment.doBuild(EstablishBuildEnvironment.java:72)
    at
org.gradle.launcher.daemon.server.exec.BuildCommandOnly.execute(BuildCommandOnly.java:36)
    at
org.gradle.launcher.daemon.server.api.DaemonCommandExecution.proceed(DaemonCommandExecution.java:120)
    at
org.gradle.launcher.daemon.server.health.HintGCAfterBuild.execute(HintGCAfterBuild.java:41)
    at
org.gradle.launcher.daemon.server.api.DaemonCommandExecution.proceed(DaemonCommandExecution.java:120)
    at
org.gradle.launcher.daemon.server.exec.StartBuildOrRespondWithBusy$1.run(StartBuildOrRespondWithBusy.java:50)
    at
org.gradle.launcher.daemon.server.DaemonStateCoordinator$1.run(DaemonStateCoordinator.java:237)
    at
org.gradle.internal.concurrent.ExecutorPolicy$CatchAndRecordFailures.onExecute(ExecutorPolicy.java:54)
    at
org.gradle.internal.concurrent.StoppableExecutorImpl$1.run(StoppableExecutorImpl.java:40)
Caused by: org.gradle.api.tasks.TaskExecutionException: Execution
failed for task ':compileJava'.     at
org.gradle.api.internal.tasks.execution.ExecuteActionsTaskExecuter.executeActions(ExecuteActionsTaskExecuter.java:69)
    at
org.gradle.api.internal.tasks.execution.ExecuteActionsTaskExecuter.execute(ExecuteActionsTaskExecuter.java:46)
    at
org.gradle.api.internal.tasks.execution.PostExecutionAnalysisTaskExecuter.execute(PostExecutionAnalysisTaskExecuter.java:35)
    at
org.gradle.api.internal.tasks.execution.SkipUpToDateTaskExecuter.execute(SkipUpToDateTaskExecuter.java:66)
    at
org.gradle.api.internal.tasks.execution.ValidatingTaskExecuter.execute(ValidatingTaskExecuter.java:58)
    at
org.gradle.api.internal.tasks.execution.SkipEmptySourceFilesTaskExecuter.execute(SkipEmptySourceFilesTaskExecuter.java:52)
    at
org.gradle.api.internal.tasks.execution.SkipTaskWithNoActionsExecuter.execute(SkipTaskWithNoActionsExecuter.java:52)
    at
org.gradle.api.internal.tasks.execution.SkipOnlyIfTaskExecuter.execute(SkipOnlyIfTaskExecuter.java:53)
    at
org.gradle.api.internal.tasks.execution.ExecuteAtMostOnceTaskExecuter.execute(ExecuteAtMostOnceTaskExecuter.java:43)
    at
org.gradle.execution.taskgraph.DefaultTaskGraphExecuter$EventFiringTaskWorker.execute(DefaultTaskGraphExecuter.java:203)
    at
org.gradle.execution.taskgraph.DefaultTaskGraphExecuter$EventFiringTaskWorker.execute(DefaultTaskGraphExecuter.java:185)
    at
org.gradle.execution.taskgraph.AbstractTaskPlanExecutor$TaskExecutorWorker.processTask(AbstractTaskPlanExecutor.java:66)
    at
org.gradle.execution.taskgraph.AbstractTaskPlanExecutor$TaskExecutorWorker.run(AbstractTaskPlanExecutor.java:50)
    at
org.gradle.execution.taskgraph.DefaultTaskPlanExecutor.process(DefaultTaskPlanExecutor.java:25)
    at
org.gradle.execution.taskgraph.DefaultTaskGraphExecuter.execute(DefaultTaskGraphExecuter.java:110)
    at
org.gradle.execution.SelectedTaskExecutionAction.execute(SelectedTaskExecutionAction.java:37)
    at
org.gradle.execution.DefaultBuildExecuter.execute(DefaultBuildExecuter.java:37)
    at
org.gradle.execution.DefaultBuildExecuter.access$000(DefaultBuildExecuter.java:23)
    at
org.gradle.execution.DefaultBuildExecuter$1.proceed(DefaultBuildExecuter.java:43)
    at
org.gradle.execution.DryRunBuildExecutionAction.execute(DryRunBuildExecutionAction.java:32)
    at
org.gradle.execution.DefaultBuildExecuter.execute(DefaultBuildExecuter.java:37)
    at
org.gradle.execution.DefaultBuildExecuter.execute(DefaultBuildExecuter.java:30)
    at
org.gradle.initialization.DefaultGradleLauncher$4.run(DefaultGradleLauncher.java:153)
    at org.gradle.internal.Factories$1.create(Factories.java:22)    at
org.gradle.internal.progress.DefaultBuildOperationExecutor.run(DefaultBuildOperationExecutor.java:91)
    at
org.gradle.internal.progress.DefaultBuildOperationExecutor.run(DefaultBuildOperationExecutor.java:53)
    at
org.gradle.initialization.DefaultGradleLauncher.doBuildStages(DefaultGradleLauncher.java:150)
    at
org.gradle.initialization.DefaultGradleLauncher.access$200(DefaultGradleLauncher.java:32)
    at
org.gradle.initialization.DefaultGradleLauncher$1.create(DefaultGradleLauncher.java:98)
    ... 65 more Caused by:
org.gradle.api.internal.tasks.compile.CompilationFailedException:
Compilation failed with exit code 2; see the compiler error output for
details.    at
org.gradle.api.internal.tasks.compile.CommandLineJavaCompiler.executeCompiler(CommandLineJavaCompiler.java:63)
    at
org.gradle.api.internal.tasks.compile.CommandLineJavaCompiler.execute(CommandLineJavaCompiler.java:45)
    at
org.gradle.api.internal.tasks.compile.CommandLineJavaCompiler.execute(CommandLineJavaCompiler.java:34)
    at
org.gradle.api.internal.tasks.compile.NormalizingJavaCompiler.delegateAndHandleErrors(NormalizingJavaCompiler.java:104)
    at
org.gradle.api.internal.tasks.compile.NormalizingJavaCompiler.execute(NormalizingJavaCompiler.java:53)
    at
org.gradle.api.internal.tasks.compile.NormalizingJavaCompiler.execute(NormalizingJavaCompiler.java:38)
    at
org.gradle.api.internal.tasks.compile.CleaningJavaCompilerSupport.execute(CleaningJavaCompilerSupport.java:35)
    at
org.gradle.api.internal.tasks.compile.CleaningJavaCompilerSupport.execute(CleaningJavaCompilerSupport.java:25)
    at
org.gradle.api.internal.tasks.compile.incremental.IncrementalCompilationFinalizer.execute(IncrementalCompilationFinalizer.java:39)
    at
org.gradle.api.internal.tasks.compile.incremental.IncrementalCompilationFinalizer.execute(IncrementalCompilationFinalizer.java:24)
    at
org.gradle.api.tasks.compile.JavaCompile.performCompilation(JavaCompile.java:163)
    at
org.gradle.api.tasks.compile.JavaCompile.compile(JavaCompile.java:127)
    at org.gradle.internal.reflect.JavaMethod.invoke(JavaMethod.java:75)
    at
org.gradle.api.internal.project.taskfactory.AnnotationProcessingTaskFactory$IncrementalTaskAction.doExecute(AnnotationProcessingTaskFactory.java:245)
    at
org.gradle.api.internal.project.taskfactory.AnnotationProcessingTaskFactory$StandardTaskAction.execute(AnnotationProcessingTaskFactory.java:221)
    at
org.gradle.api.internal.project.taskfactory.AnnotationProcessingTaskFactory$IncrementalTaskAction.execute(AnnotationProcessingTaskFactory.java:232)
    at
org.gradle.api.internal.project.taskfactory.AnnotationProcessingTaskFactory$StandardTaskAction.execute(AnnotationProcessingTaskFactory.java:210)
    at
org.gradle.api.internal.tasks.execution.ExecuteActionsTaskExecuter.executeAction(ExecuteActionsTaskExecuter.java:80)
    at
org.gradle.api.internal.tasks.execution.ExecuteActionsTaskExecuter.executeActions(ExecuteActionsTaskExecuter.java:61)
    ... 93 more 2017-05-11 10:21:53,101 [  30511]   INFO -
.BaseProjectImportErrorHandler - Failed to import Gradle project at
'C:/projects/erib'  org.gradle.tooling.BuildException: Could not run
build action using Gradle distribution
'file:/C:/projects/erib/gradle/wrapper/gradle-2.14-bin.zip'.    at
org.gradle.tooling.internal.consumer.ResultHandlerAdapter.onFailure(ResultHandlerAdapter.java:53)
    at
org.gradle.tooling.internal.consumer.async.DefaultAsyncConsumerActionExecutor$1$1.run(DefaultAsyncConsumerActionExecutor.java:57)
    at
org.gradle.internal.concurrent.DefaultExecutorFactory$StoppableExecutorImpl$1.run(DefaultExecutorFactory.java:64)
    at
java.util.concurrent.ThreadPoolExecutor.runWorker(ThreadPoolExecutor.java:1142)
    at
java.util.concurrent.ThreadPoolExecutor$Worker.run(ThreadPoolExecutor.java:617)
    at java.lang.Thread.run(Thread.java:745)    at
org.gradle.tooling.internal.consumer.BlockingResultHandler.getResult(BlockingResultHandler.java:46)
    at
org.gradle.tooling.internal.consumer.DefaultBuildActionExecuter.run(DefaultBuildActionExecuter.java:46)
    at
org.jetbrains.plugins.gradle.service.project.GradleProjectResolver.doResolveProjectInfo(GradleProjectResolver.java:174)
    at
org.jetbrains.plugins.gradle.service.project.GradleProjectResolver.access$300(GradleProjectResolver.java:63)
    at
org.jetbrains.plugins.gradle.service.project.GradleProjectResolver$ProjectConnectionDataNodeFunction.fun(GradleProjectResolver.java:359)
    at
org.jetbrains.plugins.gradle.service.project.GradleProjectResolver$ProjectConnectionDataNodeFunction.fun(GradleProjectResolver.java:331)
    at
org.jetbrains.plugins.gradle.service.project.GradleExecutionHelper.execute(GradleExecutionHelper.java:214)
    at
org.jetbrains.plugins.gradle.service.project.GradleProjectResolver.resolveProjectInfo(GradleProjectResolver.java:95)
    at
org.jetbrains.plugins.gradle.service.project.GradleProjectResolver.resolveProjectInfo(GradleProjectResolver.java:63)
    at
com.intellij.openapi.externalSystem.service.remote.RemoteExternalSystemProjectResolverImpl$1.produce(RemoteExternalSystemProjectResolverImpl.java:41)
    at
com.intellij.openapi.externalSystem.service.remote.RemoteExternalSystemProjectResolverImpl$1.produce(RemoteExternalSystemProjectResolverImpl.java:37)
    at
com.intellij.openapi.externalSystem.service.remote.AbstractRemoteExternalSystemService.execute(AbstractRemoteExternalSystemService.java:59)
    at
com.intellij.openapi.externalSystem.service.remote.RemoteExternalSystemProjectResolverImpl.resolveProjectInfo(RemoteExternalSystemProjectResolverImpl.java:37)
    at
com.intellij.openapi.externalSystem.service.remote.wrapper.ExternalSystemProjectResolverWrapper.resolveProjectInfo(ExternalSystemProjectResolverWrapper.java:49)
    at
com.intellij.openapi.externalSystem.service.internal.ExternalSystemResolveProjectTask.doExecute(ExternalSystemResolveProjectTask.java:51)
    at
com.intellij.openapi.externalSystem.service.internal.AbstractExternalSystemTask.execute(AbstractExternalSystemTask.java:137)
    at
com.intellij.openapi.externalSystem.service.internal.AbstractExternalSystemTask.execute(AbstractExternalSystemTask.java:123)
    at
com.intellij.openapi.externalSystem.util.ExternalSystemUtil$2.execute(ExternalSystemUtil.java:477)
    at
com.intellij.openapi.externalSystem.util.ExternalSystemUtil$3$1.run(ExternalSystemUtil.java:545)
    at
com.intellij.openapi.progress.impl.ProgressManagerImpl$TaskRunnable.run(ProgressManagerImpl.java:621)
    at
com.intellij.openapi.progress.impl.ProgressManagerImpl$7.run(ProgressManagerImpl.java:422)
    at
com.intellij.openapi.progress.impl.ProgressManagerImpl$3.run(ProgressManagerImpl.java:194)
    at
com.intellij.openapi.progress.impl.ProgressManagerImpl.a(ProgressManagerImpl.java:281)
    at
com.intellij.openapi.progress.impl.ProgressManagerImpl.executeProcessUnderProgress(ProgressManagerImpl.java:233)
    at
com.intellij.openapi.progress.impl.ProgressManagerImpl.runProcess(ProgressManagerImpl.java:181)
    at
com.intellij.openapi.application.impl.ApplicationImpl$10$1.run(ApplicationImpl.java:641)
    at
com.intellij.openapi.application.impl.ApplicationImpl$8.run(ApplicationImpl.java:406)
    at
java.util.concurrent.Executors$RunnableAdapter.call(Executors.java:511)
    at java.util.concurrent.FutureTask.run(FutureTask.java:266)     at
java.util.concurrent.ThreadPoolExecutor.runWorker(ThreadPoolExecutor.java:1142)
    at
java.util.concurrent.ThreadPoolExecutor$Worker.run(ThreadPoolExecutor.java:617)
    at java.lang.Thread.run(Thread.java:745)    at
org.jetbrains.ide.PooledThreadExecutor$1$1.run(PooledThreadExecutor.java:56)

Respuesta 1

Prueba esto:

1) Archivo -> Invalidar cachés / reiniciar

2) Apagado Idea Intellij

3) Eliminar la carpeta .gradle en el directorio de inicio del usuario

4) Reinicia Intellij Idea, deja que descargue todo el material de Gradle que necesita

Después de esto, debería construirse con éxito

Espero eso ayude)

Respuesta: 2

Intenta usar una versión diferente de gradle. Parece que estás usando una versión anterior. La última versión es la 3.5. También puede verificar qué versión se usa en la versión original y usar esa.

Si ninguno funciona, intente lo siguiente
1. Cierre el IDE
2. Elimine la carpeta .gradle en el directorio de inicio
inicio 3. Inicie el IDE. Deje que actualice el proyecto Gradle y descargue los archivos necesarios

Respuesta: 3

Estoy tratando de aprender Java. Me gustaría tener una enumeración como parámetro en el constructor. Pero recibo un error. Persona de clase pública {int int edad, peso, altura; Cadena privada ...

¿Cómo almacenarías / representaría una cadena en un largo? Luego, ¿atascarlo en una matriz de 8 bytes? Cosas que he probado / trabajando con String eidString = "Awesome!"; ByteBuffer buf = ByteBuffer.allocate (8); ...

Tengo un mapa como el siguiente: class Person {Long personId; Nombre de cadena; / * Getters and Setters * /} He rellenado un mapa Map <Long, Person> personMap = new HashMap <> (); ...

Tengo una jerarquía de clases como esta Bebida -> Café-> Latte. Donde bebida es la superclase abstracta que está extendiendo Coffee. La clase de café luego agrega algo de comportamiento, pero también es abstracta. ...